Reaction Details
TargetGonadotropin-releasing hormone receptor
LigandBDBM50098391
Substrate/Competitorn/a
Meas. Tech.ChEBML_71746
Ki 4±n/a nM
Citation Guo, ZChen, YWu, DZhu, YFStruthers, RSSaunders, JXie, QChen, C Synthesis and structure-activity relationships of thieno[2,3-d]pyrimidine-2,4-dione derivatives as potent GnRH receptor antagonists. Bioorg Med Chem Lett13:3617-22 (2003) Gonadotropin-releasing hormone receptor
Name:Gonadotropin-releasing hormone receptor
Type:PROTEIN
Mol. Mass.:37767.60
Organism:Rattus norvegicus
Description:ChEMBL_1335047
Residue:327
BDBM50098391
NameBDBM50098391
Synonyms:(S)-4-(2-(azetidin-2-yl)ethoxy)-7-chloro-2-oxo-N-(pyrimidin-4-yl)-3-(3,4,5-trimethylphenyl)-1,2-dihydroquinoline-6-carboxamide 4-(2-Azetidin-2-yl-ethoxy)-7-chloro-2-oxo-3-(3,4,5-trimethyl-phenyl)-1,2-dihydro-quinoline-6-carboxylic acid pyrimidin-4-ylamide | CHEMBL120432
TypeSmall organic molecule
Emp. Form.C28H28ClN5O3
Mol. Mass.518.007
SMILESCc1cc(cc(C)c1C)-c1c(OCC[C@@H]2CCN2)c2cc(C(=O)Nc3ccncn3)c(Cl)cc2[nH]c1=O