Reaction Details
TargetCaspase-1
LigandBDBM50133876
Substrate/Competitorn/a
Meas. Tech.ChEBML_46875
Ki 70.0±n/a nM
Citation Ullman, BRAja, TDeckwerth, TLDiaz, JLHerrmann, JKalish, VJKaranewsky, DSMeduna, SPNalley, KRobinson, EDRoggo, SPSayers, ROSchmitz, ATernansky, RJTomaselli, KJWu, JC Structure-activity relationships within a series of caspase inhibitors: effect of leaving group modifications. Bioorg Med Chem Lett13:3623-6 (2003) Caspase-1
Name:Caspase-1
Type:PROTEIN
Mol. Mass.:45636.44
Organism:Mus musculus
Description:ChEMBL_651546
Residue:402
BDBM50133876
NameBDBM50133876
Synonyms:(S)-3-{(S)-3-Methyl-2-[2-(naphthalen-1-yloxy)-acetylamino]-butyrylamino}-5-(naphthalen-1-yloxy)-4-oxo-pentanoic acid | CHEMBL118738
TypeSmall organic molecule
Emp. Form.C32H32N2O7
Mol. Mass.556.6057
SMILESCC(C)[C@H](NC(=O)COc1cccc2ccccc12)C(=O)N[C@@H](CC(O)=O)C(=O)COc1cccc2ccccc12