Reaction Details
TargetcGMP-specific 3',5'-cyclic phosphodiesterase
LigandBDBM50134123
Substrate/Competitorn/a
Meas. Tech.ChEMBL_155186 (CHEMBL761833)
IC50 5±n/a nM
Citation Daugan, AGrondin, PRuault, CLe Monnier de Gouville, ACCoste, HLinget, JMKirilovsky, JHyafil, FLabaudinière, R The discovery of tadalafil: a novel and highly selective PDE5 inhibitor. 2: 2,3,6,7,12,12a-hexahydropyrazino[1',2':1,6]pyrido[3,4-b]indole-1,4-dione analogues. J Med Chem46:4533-42 (2003) 
 
cGMP-specific 3',5'-cyclic phosphodiesterase
Name:cGMP-specific 3',5'-cyclic phosphodiesterase
Type:PROTEIN
Mol. Mass.:98615.45
Organism:Bos taurus
Description:ChEMBL_155186
Residue:865
BDBM50134123
NameBDBM50134123
Synonyms:(6R,7R)-10-Butyl-6-(4-methoxy-phenyl)-5,6,9,10,11a,12-hexahydro-indolo[3,2-b]quinolizine-8,11-dione CHEMBL139771
TypeSmall organic molecule
Emp. Form.C24H25N3O3
Mol. Mass.403.4736
SMILESCCCCn1c(O)c2Cc3c([nH]c4ccccc34)C(c3ccc(OC)cc3)n2c1=O