Reaction Details
TargetcGMP-specific 3',5'-cyclic phosphodiesterase
LigandBDBM50134145
Substrate/Competitorn/a
Meas. Tech.ChEMBL_155186 (CHEMBL761833)
IC50 6±n/a nM
Citation Daugan, AGrondin, PRuault, CLe Monnier de Gouville, ACCoste, HLinget, JMKirilovsky, JHyafil, FLabaudinière, R The discovery of tadalafil: a novel and highly selective PDE5 inhibitor. 2: 2,3,6,7,12,12a-hexahydropyrazino[1',2':1,6]pyrido[3,4-b]indole-1,4-dione analogues. J Med Chem46:4533-42 (2003) 
 
cGMP-specific 3',5'-cyclic phosphodiesterase
Name:cGMP-specific 3',5'-cyclic phosphodiesterase
Type:PROTEIN
Mol. Mass.:98615.45
Organism:Bos taurus
Description:ChEMBL_155186
Residue:865
BDBM50134145
NameBDBM50134145
Synonyms:(R)-10-Benzo[1,3]dioxol-5-yl-2-benzyl-3a,4,9,10-tetrahydro-2,9,10a-triaza-cyclopenta[b]fluorene-1,3-dione | CHEMBL140599
TypeSmall organic molecule
Emp. Form.C27H21N3O4
Mol. Mass.451.4733
SMILESOc1c2Cc3c([nH]c4ccccc34)C(c3ccc4OCOc4c3)n2c(=O)n1Cc1ccccc1