Reaction Details
Target3-oxoacyl-[acyl-carrier-protein] synthase 3
LigandBDBM50134351
Substrate/Competitorn/a
Meas. Tech.ChEBML_37595
IC50 52000±n/a nM
Citation Senior, SJIllarionov, PAGurcha, SSCampbell, IBSchaeffer, MLMinnikin, DEBesra, GS Biphenyl-based analogues of thiolactomycin, active against Mycobacterium tuberculosis mtFabH fatty acid condensing enzyme. Bioorg Med Chem Lett13:3685-8 (2003) 3-oxoacyl-[acyl-carrier-protein] synthase 3
Name:3-oxoacyl-[acyl-carrier-protein] synthase 3
Type:Enzyme
Mol. Mass.:34865.07
Organism:Mycobacterium tuberculosis
Description:P9WNG3
Residue:335
BDBM50134351
NameBDBM50134351
Synonyms:4-Hydroxy-3,5-dimethyl-5-(3-phenoxy-benzyl)-5H-thiophen-2-one | CHEMBL332364
TypeSmall organic molecule
Emp. Form.C19H18O3S
Mol. Mass.326.409
SMILESCC1C(=O)SC(C)(Cc2cccc(Oc3ccccc3)c2)C1=O