Reaction Details
Target3-oxoacyl-[acyl-carrier-protein] synthase 3
LigandBDBM50134361
Substrate/Competitorn/a
Meas. Tech.ChEBML_37595
IC50 51000±n/a nM
Citation Senior, SJIllarionov, PAGurcha, SSCampbell, IBSchaeffer, MLMinnikin, DEBesra, GS Biphenyl-based analogues of thiolactomycin, active against Mycobacterium tuberculosis mtFabH fatty acid condensing enzyme. Bioorg Med Chem Lett13:3685-8 (2003) 3-oxoacyl-[acyl-carrier-protein] synthase 3
Name:3-oxoacyl-[acyl-carrier-protein] synthase 3
Type:Enzyme
Mol. Mass.:34865.07
Organism:Mycobacterium tuberculosis
Description:P9WNG3
Residue:335
BDBM50134361
NameBDBM50134361
Synonyms:5-Biphenyl-4-ylmethyl-4-hydroxy-3,5-dimethyl-5H-thiophen-2-one | CHEMBL333742
TypeSmall organic molecule
Emp. Form.C19H18O2S
Mol. Mass.310.41
SMILESCC1C(=O)SC(C)(Cc2ccc(cc2)-c2ccccc2)C1=O