Reaction Details
TargetProstaglandin E2 receptor EP3 subtype
LigandBDBM50134516
Substrate/Competitorn/a
Meas. Tech.ChEBML_158318
Ki 16±n/a nM
Citation Gallant, MBelley, MCarrière, MCChateauneuf, ADenis, DLachance, NLamontagne, SMetters, KMSawyer, NSlipetz, DTruchon, JFLabelle, M Structure-activity relationship of triaryl propionic acid analogues on the human EP3 prostanoid receptor. Bioorg Med Chem Lett13:3813-6 (2003) Prostaglandin E2 receptor EP3 subtype
Name:Prostaglandin E2 receptor EP3 subtype
Type:Enzyme
Mol. Mass.:43335.03
Organism:Homo sapiens (Human)
Description:P43115
Residue:390
BDBM50134516
NameBDBM50134516
Synonyms:CHEMBL434637 | Thiophene-2-sulfonic acid [3-(2''-benzyloxy-[1,1';3',1'']terphenyl-2-yl)-propionyl]-amide
TypeSmall organic molecule
Emp. Form.C32H27NO4S2
Mol. Mass.553.691
SMILESO=C(CCc1ccccc1-c1cccc(c1)-c1ccccc1OCc1ccccc1)NS(=O)(=O)c1cccs1