Reaction Details
TargetGeranylgeranyl transferase type-1 subunit beta/Protein farnesyltransferase/geranylgeranyltransferase type-1 subunit alpha
LigandBDBM50134559
Substrate/Competitorn/a
Meas. Tech.ChEMBL_71791 (CHEMBL686002)
IC50 150±n/a nM
Citation Lin, NHWang, LCohen, JGu, WZFrost, DZhang, HRosenberg, SSham, H Synthesis and biological evaluation of 4-[(3-methyl-3H-imidazol-4-yl)-(2-phenylethynyl-benzyloxy)-methyl]-benzonitrile as novel farnesyltransferase inhibitor. Bioorg Med Chem Lett13:3821-5 (2003) Geranylgeranyl transferase type-1 subunit beta/Protein farnesyltransferase/geranylgeranyltransferase type-1 subunit alpha
Name:Geranylgeranyl transferase type-1 subunit beta/Protein farnesyltransferase/geranylgeranyltransferase type-1 subunit alpha
Type:n/a
Mol. Mass.:n/a
Description:ASSAY_ID of EBI is 70196
Components:This complex has 2 components.
Component 1
Name:Protein farnesyltransferase/geranylgeranyltransferase type-1 subunit alpha
Synonyms:CAAX farnesyltransferase alpha subunit FNTA_HUMAN FTase-alpha Geranylgeranyl Transferase (GGTase-I) Chain A Protein Farnesyltransferase (PFT) Chain A Protein farnesyltransferase Protein farnesyltransferase/geranylgeranyltransferase type I alpha subunit | Ras proteins prenyltransferase alpha
Type:Enzyme
Mol. Mass.:44392.46
Organism:Homo sapiens (Human)
Description:Recombinant human FTase.
Residue:379
Component 2
Name:Geranylgeranyl transferase type-1 subunit beta
Synonyms:2.5.1.59 Geranylgeranyl transferase type I Geranylgeranyl transferase type I subunit beta PGGT1B Protein farnesyl/geranylgeranyl transferase | Type I protein geranyl-geranyltransferase subunit beta
Type:n/a
Mol. Mass.:42369.84
Organism:Homo sapiens (Human)
Description:n/a
Residue:377
BDBM50134559
NameBDBM50134559
Synonyms:4-[(4-Cyano-phenyl)-(3-methyl-3H-imidazol-4-yl)-methoxymethyl]-3-(4-nitro-phenylethynyl)-benzonitrile | CHEMBL340122
TypeSmall organic molecule
Emp. Form.C28H19N5O3
Mol. Mass.473.4822
SMILESCn1cncc1C(OCc1ccc(cc1C#Cc1ccc(cc1)[N+]([O-])=O)C#N)c1ccc(cc1)C#N