Reaction Details
TargetProtein kinase C alpha type
LigandBDBM14187
Substrate/Competitorn/a
Meas. Tech.ChEBML_160104
IC50 52750±n/a nM
Citation Sanchez-Martinez, CShih, CFaul, MMZhu, GPaal, MSomoza, CLi, TKumrich, CAWinneroski, LLXun, ZBrooks, HBPatel, BKSchultz, RMDeHahn, TBSpencer, CDWatkins, SAConsidine, EDempsey, JAOgg, CACampbell, RMAnderson, BAWagner, J Aryl[a]pyrrolo[3,4-c]carbazoles as selective cyclin D1-CDK4 inhibitors. Bioorg Med Chem Lett13:3835-9 (2003) Protein kinase C alpha type
Name:Protein kinase C alpha type
Type:Enzyme
Mol. Mass.:76755.65
Organism:Homo sapiens (Human)
Description:The recombinant human PKC enzymes were produced using a baculovirus expression system in SF9 cells
Residue:672
BDBM14187
NameBDBM14187
Synonyms:3,13-diazahexacyclo[14.8.0.0^{2,10}.0^{4,9}.0^{11,15}.0^{17,22}]tetracosa-1(16),2(10),4(9),5,7,11(15),17(22),18,20,23-decaene-12,14-dione CHEMBL332575 | Imide Analog 12
TypeSmall organic molecule
Emp. Form.C22H12N2O2
Mol. Mass.336.3429
SMILESO=C1NC(=O)c2c1c1c3ccccc3[nH]c1c1ccc3ccccc3c21