Reaction Details
TargetCyclin-dependent kinase 1/G2/mitotic-specific cyclin-B1/G2/mitotic-specific cyclin-B2/G2/mitotic-specific cyclin-B3
LigandBDBM14187
Substrate/Competitorn/a
Meas. Tech.ChEMBL_52490 (CHEMBL666084)
IC50 590±n/a nM
Citation Sanchez-Martinez, CShih, CFaul, MMZhu, GPaal, MSomoza, CLi, TKumrich, CAWinneroski, LLXun, ZBrooks, HBPatel, BKSchultz, RMDeHahn, TBSpencer, CDWatkins, SAConsidine, EDempsey, JAOgg, CACampbell, RMAnderson, BAWagner, J Aryl[a]pyrrolo[3,4-c]carbazoles as selective cyclin D1-CDK4 inhibitors. Bioorg Med Chem Lett13:3835-9 (2003) Cyclin-dependent kinase 1/G2/mitotic-specific cyclin-B1/G2/mitotic-specific cyclin-B2/G2/mitotic-specific cyclin-B3
Name:Cyclin-dependent kinase 1/G2/mitotic-specific cyclin-B1/G2/mitotic-specific cyclin-B2/G2/mitotic-specific cyclin-B3
Type:n/a
Mol. Mass.:n/a
Description:ASSAY_ID of EBI is 40085
Components:This complex has 4 components.
Component 1
Name:G2/mitotic-specific cyclin-B3
Synonyms:CCNB3 CYCB3 G2/mitotic-specific cyclin-B3
Type:PROTEIN
Mol. Mass.:157916.84
Organism:Homo sapiens (Human)
Description:n/a
Residue:1395
Component 2
Name:G2/mitotic-specific cyclin-B1
Synonyms:CCNB CCNB1_HUMAN
Type:Enzyme Subunit
Mol. Mass.:48340.95
Organism:Homo sapiens (Human)
Description:P14635
Residue:433
Component 3
Name:G2/mitotic-specific cyclin-B2
Synonyms:CCNB2 Cyclin-dependent kinase 1/cyclin B | G2/mitotic-specific cyclin-B2
Type:PROTEIN
Mol. Mass.:45293.13
Organism:Homo sapiens (Human)
Description:n/a
Residue:398
Component 4
Name:Cyclin-dependent kinase 1
Synonyms:CDC2 CDK1 CDKN1 Cell division protein kinase 1 P34CDC2 | p34 protein kinase
Type:Enzyme Subunit
Mol. Mass.:34101.08
Organism:Homo sapiens (Human)
Description:P06493
Residue:297
BDBM14187
NameBDBM14187
Synonyms:3,13-diazahexacyclo[14.8.0.0^{2,10}.0^{4,9}.0^{11,15}.0^{17,22}]tetracosa-1(16),2(10),4(9),5,7,11(15),17(22),18,20,23-decaene-12,14-dione CHEMBL332575 | Imide Analog 12
TypeSmall organic molecule
Emp. Form.C22H12N2O2
Mol. Mass.336.3429
SMILESO=C1NC(=O)c2c1c1c3ccccc3[nH]c1c1ccc3ccccc3c21