Reaction Details
TargetAdenosine kinase
LigandBDBM50134753
Substrate/Competitorn/a
Meas. Tech.ChEMBL_31113 (CHEMBL642224)
IC50 0.8±n/a nM
Citation Ugarkar, BGCastellino, AJDaRe, JSRamirez-Weinhouse, MKopcho, JJRosengren, SErion, MD Adenosine kinase inhibitors. 3. Synthesis, SAR, and antiinflammatory activity of a series of l-lyxofuranosyl nucleosides. J Med Chem46:4750-60 (2003) 
 
Adenosine kinase
Name:Adenosine kinase
Type:PROTEIN
Mol. Mass.:40545.97
Organism:Homo sapiens (Human)
Description:ChEMBL_1467841
Residue:362
BDBM50134753
NameBDBM50134753
Synonyms:(1R,4S,5R)-2-Methyl-5-(5-phenyl-4-phenylamino-pyrrolo[2,3-d]pyrimidin-7-yl)-tetrahydro-furan-3,4-diol CHEMBL436598
TypeSmall organic molecule
Emp. Form.C23H22N4O3
Mol. Mass.402.4458
SMILESC[C@@H]1O[C@H]([C@H](O)[C@@H]1O)n1cc(-c2ccccc2)c2c(Nc3ccccc3)ncnc12