Reaction Details
TargetPlatelet-derived growth factor receptor beta
LigandBDBM50118831
Substrate/Competitorn/a
Meas. Tech.ChEMBL_158653 (CHEMBL763439)
IC50 90±n/a nM
Citation Matsuno, KUshiki, JSeishi, TIchimura, MGiese, NAYu, JCTakahashi, SOda, SNomoto, Y Potent and selective inhibitors of platelet-derived growth factor receptor phosphorylation. 3. Replacement of quinazoline moiety and improvement of metabolic polymorphism of 4-[4-(N-substituted (thio)carbamoyl)-1-piperazinyl]-6,7-dimethoxyquinazoline derivatives. J Med Chem46:4910-25 (2003) 
 
Platelet-derived growth factor receptor beta
Name:Platelet-derived growth factor receptor beta
Type:Enzyme
Mol. Mass.:123922.25
Organism:Homo sapiens (Human)
Description:P09619
Residue:1106
BDBM50118831
NameBDBM50118831
Synonyms:4-(6,7-Dimethoxy-quinazolin-4-yl)-piperazine-1-carbothioic acid benzylamide | CHEMBL319894
TypeSmall organic molecule
Emp. Form.C22H25N5O2S
Mol. Mass.423.531
SMILESCOc1cc2ncnc(N3CCN(CC3)C(=S)NCc3ccccc3)c2cc1OC