Reaction Details
TargetPlatelet-derived growth factor receptor beta
LigandBDBM50134868
Substrate/Competitorn/a
Meas. Tech.ChEMBL_158653 (CHEMBL763439)
IC50 90±n/a nM
Citation Matsuno, KUshiki, JSeishi, TIchimura, MGiese, NAYu, JCTakahashi, SOda, SNomoto, Y Potent and selective inhibitors of platelet-derived growth factor receptor phosphorylation. 3. Replacement of quinazoline moiety and improvement of metabolic polymorphism of 4-[4-(N-substituted (thio)carbamoyl)-1-piperazinyl]-6,7-dimethoxyquinazoline derivatives. J Med Chem46:4910-25 (2003) 
 
Platelet-derived growth factor receptor beta
Name:Platelet-derived growth factor receptor beta
Type:Enzyme
Mol. Mass.:123922.25
Organism:Homo sapiens (Human)
Description:P09619
Residue:1106
BDBM50134868
NameBDBM50134868
Synonyms:6,7-Dimethoxy-4-[4-(4-phenoxy-phenylcarbamoyl)-piperazin-1-yl]-quinoline-3-carboxylic acid ethyl ester | CHEMBL357673
TypeSmall organic molecule
Emp. Form.C31H32N4O6
Mol. Mass.556.609
SMILESCCOC(=O)c1cnc2cc(OC)c(OC)cc2c1N1CCN(CC1)C(=O)Nc1ccc(Oc2ccccc2)cc1