Reaction Details
TargetPlatelet-derived growth factor receptor beta
LigandBDBM50132235
Substrate/Competitorn/a
Meas. Tech.ChEMBL_158653 (CHEMBL763439)
IC50>30000±n/a nM
Citation Matsuno, KUshiki, JSeishi, TIchimura, MGiese, NAYu, JCTakahashi, SOda, SNomoto, Y Potent and selective inhibitors of platelet-derived growth factor receptor phosphorylation. 3. Replacement of quinazoline moiety and improvement of metabolic polymorphism of 4-[4-(N-substituted (thio)carbamoyl)-1-piperazinyl]-6,7-dimethoxyquinazoline derivatives. J Med Chem46:4910-25 (2003) 
 
Platelet-derived growth factor receptor beta
Name:Platelet-derived growth factor receptor beta
Type:Enzyme
Mol. Mass.:123922.25
Organism:Homo sapiens (Human)
Description:P09619
Residue:1106
BDBM50132235
NameBDBM50132235
Synonyms:4-Quinazolin-4-yl-piperazine-1-carbothioic acid benzylamide | CHEMBL103447
TypeSmall organic molecule
Emp. Form.C20H21N5S
Mol. Mass.363.479
SMILESS=C(NCc1ccccc1)N1CCN(CC1)c1ncnc2ccccc12