Reaction Details
TargetPlatelet-derived growth factor receptor beta
LigandBDBM50134885
Substrate/Competitorn/a
Meas. Tech.ChEMBL_158653 (CHEMBL763439)
IC50>30000±n/a nM
Citation Matsuno, KUshiki, JSeishi, TIchimura, MGiese, NAYu, JCTakahashi, SOda, SNomoto, Y Potent and selective inhibitors of platelet-derived growth factor receptor phosphorylation. 3. Replacement of quinazoline moiety and improvement of metabolic polymorphism of 4-[4-(N-substituted (thio)carbamoyl)-1-piperazinyl]-6,7-dimethoxyquinazoline derivatives. J Med Chem46:4910-25 (2003) 
 
Platelet-derived growth factor receptor beta
Name:Platelet-derived growth factor receptor beta
Type:Enzyme
Mol. Mass.:123922.25
Organism:Homo sapiens (Human)
Description:P09619
Residue:1106
BDBM50134885
NameBDBM50134885
Synonyms:4-(6,7-Bis-benzyloxy-quinazolin-4-yl)-piperazine-1-carboxylic acid (4-phenoxy-phenyl)-amide | CHEMBL144990
TypeSmall organic molecule
Emp. Form.C39H35N5O4
Mol. Mass.637.7263
SMILESO=C(Nc1ccc(Oc2ccccc2)cc1)N1CCN(CC1)c1ncnc2cc(OCc3ccccc3)c(OCc3ccccc3)cc12