Reaction Details
TargetPlatelet-derived growth factor receptor beta
LigandBDBM50134892
Substrate/Competitorn/a
Meas. Tech.ChEMBL_158653 (CHEMBL763439)
IC50 21000±n/a nM
Citation Matsuno, KUshiki, JSeishi, TIchimura, MGiese, NAYu, JCTakahashi, SOda, SNomoto, Y Potent and selective inhibitors of platelet-derived growth factor receptor phosphorylation. 3. Replacement of quinazoline moiety and improvement of metabolic polymorphism of 4-[4-(N-substituted (thio)carbamoyl)-1-piperazinyl]-6,7-dimethoxyquinazoline derivatives. J Med Chem46:4910-25 (2003) 
 
Platelet-derived growth factor receptor beta
Name:Platelet-derived growth factor receptor beta
Type:Enzyme
Mol. Mass.:123922.25
Organism:Homo sapiens (Human)
Description:P09619
Residue:1106
BDBM50134892
NameBDBM50134892
Synonyms:4-(2-Oxo-1,3-dipropyl-2,3-dihydro-1H-imidazo[4,5-g]quinazolin-8-yl)-piperazine-1-carboxylic acid (4-phenoxy-phenyl)-amide | CHEMBL342280
TypeSmall organic molecule
Emp. Form.C32H35N7O3
Mol. Mass.565.6654
SMILESCCCn1c2cc3ncnc(N4CCN(CC4)C(=O)Nc4ccc(Oc5ccccc5)cc4)c3cc2n(CCC)c1=O