Reaction Details
TargetPlatelet-derived growth factor receptor beta
LigandBDBM50134895
Substrate/Competitorn/a
Meas. Tech.ChEMBL_158653 (CHEMBL763439)
IC50 100±n/a nM
Citation Matsuno, KUshiki, JSeishi, TIchimura, MGiese, NAYu, JCTakahashi, SOda, SNomoto, Y Potent and selective inhibitors of platelet-derived growth factor receptor phosphorylation. 3. Replacement of quinazoline moiety and improvement of metabolic polymorphism of 4-[4-(N-substituted (thio)carbamoyl)-1-piperazinyl]-6,7-dimethoxyquinazoline derivatives. J Med Chem46:4910-25 (2003) 
 
Platelet-derived growth factor receptor beta
Name:Platelet-derived growth factor receptor beta
Type:Enzyme
Mol. Mass.:123922.25
Organism:Homo sapiens (Human)
Description:P09619
Residue:1106
BDBM50134895
NameBDBM50134895
Synonyms:4-(7-Chloro-quinolin-4-yl)-piperazine-1-carboxylic acid (4-phenoxy-phenyl)-amide | CHEMBL147917
TypeSmall organic molecule
Emp. Form.C26H23ClN4O2
Mol. Mass.458.939
SMILESClc1ccc2c(ccnc2c1)N1CCN(CC1)C(=O)Nc1ccc(Oc2ccccc2)cc1