Reaction Details
TargetP2Y purinoceptor 1
LigandBDBM50409764
Substrate/Competitorn/a
Meas. Tech.ChEMBL_147583 (CHEMBL750161)
Ki 3.6±n/a nM
Citation Kim, HSOhno, MXu, BKim, HOChoi, YJi, XDMaddileti, SMarquez, VEHarden, TKJacobson, KA 2-Substitution of adenine nucleotide analogues containing a bicyclo[3.1.0]hexane ring system locked in a northern conformation: enhanced potency as P2Y1 receptor antagonists. J Med Chem46:4974-87 (2003) 
 
P2Y purinoceptor 1
Name:P2Y purinoceptor 1
Type:Enzyme
Mol. Mass.:42090.25
Organism:Homo sapiens (Human)
Description:P47900
Residue:373
BDBM50409764
NameBDBM50409764
Synonyms:CHEMBL2112867
TypeSmall organic molecule
Emp. Form.C14H21N5O8P2
Mol. Mass.449.2928
SMILESCNc1nc(C)nc2n(cnc12)[C@H]1C[C@H](OP(O)(O)=O)[C@]2(COP(O)(O)=O)C[C@H]12