Reaction Details
TargetDihydrofolate reductase
LigandBDBM50135137
Substrate/Competitorn/a
Meas. Tech.ChEMBL_52861 (CHEMBL884363)
IC50 230±n/a nM
Citation Gangjee, AAdair, OOQueener, SF Synthesis and biological evaluation of 2,4-diamino-6-(arylaminomethyl)pyrido[2,3-d]pyrimidines as inhibitors of Pneumocystis carinii and Toxoplasma gondii dihydrofolate reductase and as antiopportunistic infection and antitumor agents. J Med Chem46:5074-82 (2003) 
 
Dihydrofolate reductase
Name:Dihydrofolate reductase
Type:Enzyme
Mol. Mass.:17991.61
Organism:Escherichia coli
Description:E. coli DHFR was expressed in BL21, and purified to homogeneity.
Residue:159
BDBM50135137
NameBDBM50135137
Synonyms:6-[(3,4-Dichloro-phenylamino)-methyl]-pyrido[2,3-d]pyrimidine-2,4-diamine | CHEMBL147870
TypeSmall organic molecule
Emp. Form.C14H12Cl2N6
Mol. Mass.335.191
SMILESNc1nc(N)c2cc(CNc3ccc(Cl)c(Cl)c3)cnc2n1