Reaction Details
TargetDihydrofolate reductase
LigandBDBM50135143
Substrate/Competitorn/a
Meas. Tech.ChEMBL_52861 (CHEMBL884363)
IC50 210±n/a nM
Citation Gangjee, AAdair, OOQueener, SF Synthesis and biological evaluation of 2,4-diamino-6-(arylaminomethyl)pyrido[2,3-d]pyrimidines as inhibitors of Pneumocystis carinii and Toxoplasma gondii dihydrofolate reductase and as antiopportunistic infection and antitumor agents. J Med Chem46:5074-82 (2003) 
 
Dihydrofolate reductase
Name:Dihydrofolate reductase
Type:Enzyme
Mol. Mass.:17991.61
Organism:Escherichia coli
Description:E. coli DHFR was expressed in BL21, and purified to homogeneity.
Residue:159
BDBM50135143
NameBDBM50135143
Synonyms:6-[(3-Methoxy-phenylamino)-methyl]-pyrido[2,3-d]pyrimidine-2,4-diamine | CHEMBL356279
TypeSmall organic molecule
Emp. Form.C15H16N6O
Mol. Mass.296.3271
SMILESCOc1cccc(NCc2cnc3nc(N)nc(N)c3c2)c1