Reaction Details
TargetDihydrofolate reductase
LigandBDBM50029766
Substrate/Competitorn/a
Meas. Tech.ChEMBL_52861 (CHEMBL884363)
IC50 0.85±n/a nM
Citation Gangjee, AAdair, OOQueener, SF Synthesis and biological evaluation of 2,4-diamino-6-(arylaminomethyl)pyrido[2,3-d]pyrimidines as inhibitors of Pneumocystis carinii and Toxoplasma gondii dihydrofolate reductase and as antiopportunistic infection and antitumor agents. J Med Chem46:5074-82 (2003) 
 
Dihydrofolate reductase
Name:Dihydrofolate reductase
Type:Enzyme
Mol. Mass.:17991.61
Organism:Escherichia coli
Description:E. coli DHFR was expressed in BL21, and purified to homogeneity.
Residue:159
BDBM50029766
NameBDBM50029766
Synonyms:2,4-DIAMINO-5-METHYL-6-[(3,4,5-TRIMETHOXY-N-METHYLANILINO)METHYL]PYRIDO[2,3-D]PYRIMIDINE CHEMBL50514
TypeSmall organic molecule
Emp. Form.C19H24N6O3
Mol. Mass.384.4323
SMILESCOc1cc(cc(OC)c1OC)N(C)Cc1cnc2nc(N)nc(N)c2c1C