Reaction Details
TargetSodium-dependent serotonin transporter
LigandBDBM50135249
Substrate/Competitorn/a
Meas. Tech.ChEBML_194030
Ki 0.240000±n/a nM
Citation Takeuchi, KKohn, TJHonigschmidt, NARocco, VPSpinazze, PGAtkinson, STHertel, LWNelson, DLWainscott, DBAhmad, LJShaw, JThrelkeld, PGWong, DT Advances toward new antidepressants beyond SSRIs: 1-aryloxy-3-piperidinylpropan-2-ols with dual 5-HT1A receptor antagonism/SSRI activities. Part 3. Bioorg Med Chem Lett13:3939-42 (2003) Sodium-dependent serotonin transporter
Name:Sodium-dependent serotonin transporter
Type:Multi-pass membrane protein
Mol. Mass.:70168.43
Organism:Rattus norvegicus (rat)
Description:P31652
Residue:630
BDBM50135249
NameBDBM50135249
Synonyms:(S)-1-((2S,4R)-4-(5-fluorobenzo[b]thiophen-2-yl)-2-methylpiperidin-1-yl)-3-(2-methyl-1H-indol-4-yloxy)propan-2-ol CHEMBL129238
TypeSmall organic molecule
Emp. Form.C26H29FN2O2S
Mol. Mass.452.584
SMILESC[C@H]1C[C@@H](CCN1C[C@H](O)COc1cccc2[nH]c(C)cc12)c1cc2cc(F)ccc2s1