Reaction Details
TargetProtein farnesyltransferase subunit beta/geranylgeranyltransferase type-1 subunit alpha
LigandBDBM50135374
Substrate/Competitorn/a
Meas. Tech.ChEBML_68479
IC50 2.7±n/a nM
Citation Hasvold, LAWang, WGwaltney, SLRockway, TWNelson, LTMantei, RAFakhoury, SASullivan, GMLi, QLin, NHWang, LZhang, HCohen, JGu, WZMarsh, KBauch, JRosenberg, SSham, HL Pyridone-containing farnesyltransferase inhibitors: synthesis and biological evaluation. Bioorg Med Chem Lett13:4001-5 (2003) Protein farnesyltransferase subunit beta/geranylgeranyltransferase type-1 subunit alpha
Name:Protein farnesyltransferase subunit beta/geranylgeranyltransferase type-1 subunit alpha
Type:Protein Complex
Mol. Mass.:n/a
Description:To express recombinant enzyme in E. coli, the cloned human alpha and beta subunits were co-expressed from a plasmid, in which their expression was translationally coupled.
Components:This complex has 2 components.
Component 1
Name:Protein farnesyltransferase subunit beta
Synonyms:CAAX farnesyltransferase subunit alpha FNTB FTase-alpha GGTase-I-alpha Protein farnesyl/geranylgeranyl transferase Protein farnesyltransferase subunit beta Protein farnesyltransferase/geranylgeranyltransferase type-1 subunit alpha Ras proteins prenyltransferase subunit beta | Type I protein geranyl-geranyltransferase subunit alpha
Type:Enzyme Subunit
Mol. Mass.:48766.02
Organism:Homo sapiens (Human)
Description:Protein farnesyltransferase subunit beta
Residue:437
Component 2
Name:Protein farnesyltransferase/geranylgeranyltransferase type-1 subunit alpha
Synonyms:CAAX farnesyltransferase alpha subunit FNTA_HUMAN FTase-alpha Geranylgeranyl Transferase (GGTase-I) Chain A Protein Farnesyltransferase (PFT) Chain A Protein farnesyltransferase Protein farnesyltransferase/geranylgeranyltransferase type I alpha subunit | Ras proteins prenyltransferase alpha
Type:Enzyme
Mol. Mass.:44392.46
Organism:Homo sapiens (Human)
Description:Recombinant human FTase.
Residue:379
BDBM50135374
NameBDBM50135374
Synonyms:6-[(4-Cyano-phenyl)-(3-methyl-3H-imidazol-4-yl)-methoxymethyl]-5-(2,5-difluoro-phenyl)-1-methyl-2-oxo-1,2-dihydro-pyridine-3-carbonitrile | CHEMBL334490
TypeSmall organic molecule
Emp. Form.C26H19F2N5O2
Mol. Mass.471.4582
SMILESCn1cncc1C(OCc1c(cc(C#N)c(=O)n1C)-c1cc(F)ccc1F)c1ccc(cc1)C#N