Reaction Details
TargetTyrosine-protein kinase Lck
LigandBDBM13224
Substrate/Competitorn/a
Meas. Tech.ChEBML_39723
IC50 800±n/a nM
Citation Wityak, JDas, JMoquin, RVShen, ZLin, JChen, PDoweyko, AMPitt, SPang, SShen, DRFang, Qde Fex, HFSchieven, GLKanner, SBBarrish, JC Discovery and initial SAR of 2-amino-5-carboxamidothiazoles as inhibitors of the Src-family kinase p56(Lck). Bioorg Med Chem Lett13:4007-10 (2003) Tyrosine-protein kinase Lck
Name:Tyrosine-protein kinase Lck
Type:n/a
Mol. Mass.:57987.83
Organism:Homo sapiens (Human)
Description:P06239
Residue:509
BDBM13224
NameBDBM13224
Synonyms:2-N-benzene-4-methyl-5-N-(2,4,6-trimethylphenyl)-1,3-thiazole-2,5-diamido CHEMBL130719
TypeSmall organic molecule
Emp. Form.C21H21N3O2S
Mol. Mass.379.475
SMILESCc1nc(NC(=O)c2ccccc2)sc1C(=O)Nc1c(C)cc(C)cc1C