Reaction Details
TargetProto-oncogene tyrosine-protein kinase LCK
LigandBDBM50135401
Substrate/Competitorn/a
Meas. Tech.ChEBML_221476
IC50>50000±n/a nM
Citation Wityak, JDas, JMoquin, RVShen, ZLin, JChen, PDoweyko, AMPitt, SPang, SShen, DRFang, Qde Fex, HFSchieven, GLKanner, SBBarrish, JC Discovery and initial SAR of 2-amino-5-carboxamidothiazoles as inhibitors of the Src-family kinase p56(Lck). Bioorg Med Chem Lett13:4007-10 (2003) Proto-oncogene tyrosine-protein kinase LCK
Name:Proto-oncogene tyrosine-protein kinase LCK
Type:PROTEIN
Mol. Mass.:57927.84
Organism:Mus musculus
Description:ChEMBL_806408
Residue:509
BDBM50135401
NameBDBM50135401
Synonyms:CHEMBL130943 | [5-(3-Methoxy-5-trifluoromethyl-phenylcarbamoyl)-4-methyl-thiazol-2-yl]-carbamic acid tert-butyl ester
TypeSmall organic molecule
Emp. Form.C18H20F3N3O4S
Mol. Mass.431.429
SMILESCOc1cc(NC(=O)c2sc(NC(=O)OC(C)(C)C)nc2C)cc(c1)C(F)(F)F