Reaction Details
TargetProto-oncogene tyrosine-protein kinase LCK
LigandBDBM13225
Substrate/Competitorn/a
Meas. Tech.ChEBML_221476
IC50>50000±n/a nM
Citation Wityak, JDas, JMoquin, RVShen, ZLin, JChen, PDoweyko, AMPitt, SPang, SShen, DRFang, Qde Fex, HFSchieven, GLKanner, SBBarrish, JC Discovery and initial SAR of 2-amino-5-carboxamidothiazoles as inhibitors of the Src-family kinase p56(Lck). Bioorg Med Chem Lett13:4007-10 (2003) Proto-oncogene tyrosine-protein kinase LCK
Name:Proto-oncogene tyrosine-protein kinase LCK
Type:PROTEIN
Mol. Mass.:57927.84
Organism:Mus musculus
Description:ChEMBL_806408
Residue:509
BDBM13225
NameBDBM13225
Synonyms:2-[[(tert-Butyloxy)carbonyl]-amino]-4-methyl-N-phenyl-1,3-thiazole-5-carboxamide CHEMBL424450 | tert-butyl N-[4-methyl-5-(phenylcarbamoyl)-1,3-thiazol-2-yl]carbamate
TypeSmall organic molecule
Emp. Form.C16H19N3O3S
Mol. Mass.333.405
SMILESCc1nc(NC(=O)OC(C)(C)C)sc1C(=O)Nc1ccccc1