Reaction Details
TargetTyrosine-protein kinase JAK3
LigandBDBM13246
Substrate/Competitorn/a
Meas. Tech.ChEBML_91952
IC50 44±n/a nM
Citation Wityak, JDas, JMoquin, RVShen, ZLin, JChen, PDoweyko, AMPitt, SPang, SShen, DRFang, Qde Fex, HFSchieven, GLKanner, SBBarrish, JC Discovery and initial SAR of 2-amino-5-carboxamidothiazoles as inhibitors of the Src-family kinase p56(Lck). Bioorg Med Chem Lett13:4007-10 (2003) Tyrosine-protein kinase JAK3
Name:Tyrosine-protein kinase JAK3
Type:Protein
Mol. Mass.:125111.08
Organism:Homo sapiens (Human)
Description:P52333
Residue:1124
BDBM13246
NameBDBM13246
Synonyms:5-N-(2-chloro-6-methylphenyl)-2-N-cyclopropane-1,3-thiazole-2,5-diamido CHEMBL131577 | N-(2-chloro-6-methylphenyl)-2-[(cyclopropylcarbonyl)amino]-1,3-thiazole-5-carboxamide
TypeSmall organic molecule
Emp. Form.C15H14ClN3O2S
Mol. Mass.335.809
SMILESCc1cccc(Cl)c1NC(=O)c1cnc(NC(=O)C2CC2)s1