Reaction Details
TargetProto-oncogene tyrosine-protein kinase LCK
LigandBDBM13215
Substrate/Competitorn/a
Meas. Tech.ChEMBL_221476 (CHEMBL842063)
IC50 6600±n/a nM
Citation Wityak, JDas, JMoquin, RVShen, ZLin, JChen, PDoweyko, AMPitt, SPang, SShen, DRFang, Qde Fex, HFSchieven, GLKanner, SBBarrish, JC Discovery and initial SAR of 2-amino-5-carboxamidothiazoles as inhibitors of the Src-family kinase p56(Lck). Bioorg Med Chem Lett13:4007-10 (2003) Proto-oncogene tyrosine-protein kinase LCK
Name:Proto-oncogene tyrosine-protein kinase LCK
Type:PROTEIN
Mol. Mass.:57927.84
Organism:Mus musculus
Description:ChEMBL_806408
Residue:509
BDBM13215
NameBDBM13215
Synonyms:2-Aminothiazole 1 CHEMBL307976
TypeSmall organic molecule
Emp. Form.C14H17N3OS
Mol. Mass.275.369
SMILESCc1nc(N)sc1C(=O)Nc1c(C)cc(C)cc1C