Reaction Details
TargetProto-oncogene tyrosine-protein kinase LCK
LigandBDBM13242
Substrate/Competitorn/a
Meas. Tech.ChEBML_221476
IC50 70.0±n/a nM
Citation Wityak, JDas, JMoquin, RVShen, ZLin, JChen, PDoweyko, AMPitt, SPang, SShen, DRFang, Qde Fex, HFSchieven, GLKanner, SBBarrish, JC Discovery and initial SAR of 2-amino-5-carboxamidothiazoles as inhibitors of the Src-family kinase p56(Lck). Bioorg Med Chem Lett13:4007-10 (2003) Proto-oncogene tyrosine-protein kinase LCK
Name:Proto-oncogene tyrosine-protein kinase LCK
Type:PROTEIN
Mol. Mass.:57927.84
Organism:Mus musculus
Description:ChEMBL_806408
Residue:509
BDBM13242
NameBDBM13242
Synonyms:2-[(butylcarbamoyl)amino]-4-methyl-N-(2,4,6-trimethylphenyl)-1,3-thiazole-5-carboxamide BMS-354825 2-Amino-4-methyl-thiazole Analog 8c | CHEMBL131346
TypeSmall organic molecule
Emp. Form.C19H26N4O2S
Mol. Mass.374.5
SMILESCCCCNC(=O)Nc1nc(C)c(s1)C(=O)Nc1c(C)cc(C)cc1C