Reaction Details
TargetTyrosine-protein kinase Lck
LigandBDBM50135407
Substrate/Competitorn/a
Meas. Tech.ChEBML_39723
IC50>30000±n/a nM
Citation Wityak, JDas, JMoquin, RVShen, ZLin, JChen, PDoweyko, AMPitt, SPang, SShen, DRFang, Qde Fex, HFSchieven, GLKanner, SBBarrish, JC Discovery and initial SAR of 2-amino-5-carboxamidothiazoles as inhibitors of the Src-family kinase p56(Lck). Bioorg Med Chem Lett13:4007-10 (2003) Tyrosine-protein kinase Lck
Name:Tyrosine-protein kinase Lck
Type:n/a
Mol. Mass.:57987.83
Organism:Homo sapiens (Human)
Description:P06239
Residue:509
BDBM50135407
NameBDBM50135407
Synonyms:CHEMBL128581 | [4-Trifluoromethyl-5-(2,4,6-trimethyl-phenylcarbamoyl)-thiazol-2-yl]-carbamic acid tert-butyl ester
TypeSmall organic molecule
Emp. Form.C19H22F3N3O3S
Mol. Mass.429.456
SMILESCc1cc(C)c(NC(=O)c2sc(NC(=O)OC(C)(C)C)nc2C(F)(F)F)c(C)c1