Reaction Details
TargetEpidermal growth factor receptor
LigandBDBM13246
Substrate/Competitorn/a
Meas. Tech.ChEBML_67056
IC50 10000±n/a nM
Citation Wityak, JDas, JMoquin, RVShen, ZLin, JChen, PDoweyko, AMPitt, SPang, SShen, DRFang, Qde Fex, HFSchieven, GLKanner, SBBarrish, JC Discovery and initial SAR of 2-amino-5-carboxamidothiazoles as inhibitors of the Src-family kinase p56(Lck). Bioorg Med Chem Lett13:4007-10 (2003) Epidermal growth factor receptor
Name:Epidermal growth factor receptor
Type:Receptor Kinase Domain
Mol. Mass.:134279.59
Organism:Homo sapiens (Human)
Description:P00533
Residue:1210
BDBM13246
NameBDBM13246
Synonyms:5-N-(2-chloro-6-methylphenyl)-2-N-cyclopropane-1,3-thiazole-2,5-diamido CHEMBL131577 | N-(2-chloro-6-methylphenyl)-2-[(cyclopropylcarbonyl)amino]-1,3-thiazole-5-carboxamide
TypeSmall organic molecule
Emp. Form.C15H14ClN3O2S
Mol. Mass.335.809
SMILESCc1cccc(Cl)c1NC(=O)c1cnc(NC(=O)C2CC2)s1