Reaction Details
TargetRetinoic acid receptor RXR-alpha
LigandBDBM50135450
Substrate/Competitorn/a
Meas. Tech.ChEBML_44518
Ki 2.3±n/a nM
Citation Michellys, PYBoehm, MFChen, JHGrese, TAKaranewsky, DSLeibowitz, MDLiu, SMais, DAMapes, CMReifel-Miller, AOgilvie, KMRungta, DThompson, AWTyhonas, JSYumibe, NArdecky, RJ Design and synthesis of novel RXR-selective modulators with improved pharmacological profile. Bioorg Med Chem Lett13:4071-5 (2003) Retinoic acid receptor RXR-alpha
Name:Retinoic acid receptor RXR-alpha
Type:PROTEIN
Mol. Mass.:50820.38
Organism:Homo sapiens (Human)
Description:ChEMBL_1456363
Residue:462
BDBM50135450
NameBDBM50135450
Synonyms:(2E,4E,6Z)-7-[4-(2,2-Difluoro-ethoxy)-2'-fluoro-5-isopropyl-biphenyl-3-yl]-3-methyl-octa-2,4,6-trienoic acid | CHEMBL422088
TypeSmall organic molecule
Emp. Form.C26H27F3O3
Mol. Mass.444.486
SMILESCC(C)c1cc(cc(\C(C)=C/C=C/C(/C)=C/C(O)=O)c1OCC(F)F)-c1ccccc1F