Reaction Details
TargetRetinoic acid receptor RXR-alpha
LigandBDBM50135453
Substrate/Competitorn/a
Meas. Tech.ChEMBL_44523 (CHEMBL656173)
IC50 1.9±n/a nM
Citation Michellys, PYBoehm, MFChen, JHGrese, TAKaranewsky, DSLeibowitz, MDLiu, SMais, DAMapes, CMReifel-Miller, AOgilvie, KMRungta, DThompson, AWTyhonas, JSYumibe, NArdecky, RJ Design and synthesis of novel RXR-selective modulators with improved pharmacological profile. Bioorg Med Chem Lett13:4071-5 (2003) Retinoic acid receptor RXR-alpha
Name:Retinoic acid receptor RXR-alpha
Type:PROTEIN
Mol. Mass.:50820.38
Organism:Homo sapiens (Human)
Description:ChEMBL_1456363
Residue:462
BDBM50135453
NameBDBM50135453
Synonyms:(2E,4E,6Z)-7-[2-(2,2-Difluoro-ethoxy)-3-isopropyl-5-thiophen-2-yl-phenyl]-3-methyl-octa-2,4,6-trienoic acid | CHEMBL130374
TypeSmall organic molecule
Emp. Form.C24H26F2O3S
Mol. Mass.432.523
SMILESCC(C)c1cc(cc(\C(C)=C/C=C/C(/C)=C/C(O)=O)c1OCC(F)F)-c1cccs1