Reaction Details
TargetRetinoic acid receptor RXR-beta
LigandBDBM50135456
Substrate/Competitorn/a
Meas. Tech.ChEBML_196926
Ki 8.2±n/a nM
Citation Michellys, PYBoehm, MFChen, JHGrese, TAKaranewsky, DSLeibowitz, MDLiu, SMais, DAMapes, CMReifel-Miller, AOgilvie, KMRungta, DThompson, AWTyhonas, JSYumibe, NArdecky, RJ Design and synthesis of novel RXR-selective modulators with improved pharmacological profile. Bioorg Med Chem Lett13:4071-5 (2003) Retinoic acid receptor RXR-beta
Name:Retinoic acid receptor RXR-beta
Type:PROTEIN
Mol. Mass.:56932.89
Organism:Homo sapiens (Human)
Description:ChEMBL_39045
Residue:533
BDBM50135456
NameBDBM50135456
Synonyms:(2E,4E,6Z)-7-(2-Butoxy-3-isopropyl-5-pentafluoroethyl-phenyl)-3-methyl-octa-2,4,6-trienoic acid | CHEMBL424269
TypeSmall organic molecule
Emp. Form.C24H29F5O3
Mol. Mass.460.4773
SMILESCCCCOc1c(cc(cc1\C(C)=C/C=C/C(/C)=C/C(O)=O)C(F)(F)C(F)(F)F)C(C)C