Reaction Details
TargetChymase
LigandBDBM50135494
Substrate/Competitorn/a
Meas. Tech.ChEBML_49439
IC50 56±n/a nM
Citation Masaki, HMizuno, YTatui, AMurakami, AKoide, YSatoh, STakahashi, A Structure-activity relationship of benzo[b]thiophene-2-sulfonamide derivatives as novel human chymase inhibitors. Bioorg Med Chem Lett13:4085-8 (2003) Chymase
Name:Chymase
Type:Enzyme
Mol. Mass.:27340.12
Organism:Homo sapiens (Human)
Description:n/a
Residue:247
BDBM50135494
NameBDBM50135494
Synonyms:4-(5-Fluoro-3-methyl-benzo[b]thiophene-2-sulfonylamino)-3-methanesulfonyl-benzoic acid methyl ester | CHEMBL129901
TypeSmall organic molecule
Emp. Form.C18H16FNO6S3
Mol. Mass.457.516
SMILESCOC(=O)c1ccc(NS(=O)(=O)c2sc3ccc(F)cc3c2C)c(c1)S(C)(=O)=O