Reaction Details
TargetAcyl carrier protein,/NADH dehydrogenase [ubiquinone] flavoprotein 1, mitochondrial
LigandBDBM50135528
Substrate/Competitorn/a
Meas. Tech.ChEMBL_141734 (CHEMBL749247)
IC50 1.9±n/a nM
Citation Tormo, JRGallardo, TPeris, EBermejo, ACabedo, NEstornell, EZafra-Polo, MCCortes, D Inhibitory effects on mitochondrial complex I of semisynthetic mono-tetrahydrofuran acetogenin derivatives. Bioorg Med Chem Lett13:4101-5 (2003) Acyl carrier protein,/NADH dehydrogenase [ubiquinone] flavoprotein 1, mitochondrial
Name:Acyl carrier protein,/NADH dehydrogenase [ubiquinone] flavoprotein 1, mitochondrial
Synonyms:Mitochondrial complex I; NADH oxidoreductase
Type:n/a
Mol. Mass.:n/a
Description:ASSAY_ID of EBI is 141738
Components:This complex has 2 components.
Component 1
Name:NADH dehydrogenase [ubiquinone] flavoprotein 1, mitochondrial
Type:PROTEIN
Mol. Mass.:50659.85
Organism:Bos taurus
Description:EBI_100771
Residue:464
Component 2
Name:Acyl carrier protein, mitochondrial
Synonyms:ACP CI-SDAP NDUFAB1
Type:PROTEIN
Mol. Mass.:17397.64
Organism:Bos taurus
Description:ChEMBL_469770
Residue:156
BDBM50135528
NameBDBM50135528
Synonyms:(R)-5-{(6S,11S)-6,11-Dihydroxy-11-[(2S,5S)-5-((S)-1-hydroxy-dodecyl)-tetrahydro-furan-2-yl]-undecyl}-3-{2-[(E)-hydroxyimino]-propyl}-dihydro-furan-2-one | CHEMBL131461
TypeSmall organic molecule
Emp. Form.C34H63NO7
Mol. Mass.597.8665
SMILESCCCCCCCCCCC[C@H](O)[C@@H]1CC[C@H](O1)[C@@H](O)CCCC[C@@H](O)CCCCC[C@@H]1CC(CC(C)N=O)C(=O)O1