Reaction Details
TargetCathepsin B
LigandBDBM50135543
Substrate/Competitorn/a
Meas. Tech.ChEBML_47612
IC50 4.9±n/a nM
Citation Greenspan, PDClark, KLCowen, SDMcQuire, LWTommasi, RAFarley, DLQuadros, ECoppa, DEDu, ZFang, ZZhou, HDoughty, JToscano, KTWigg, AMZhou, S N-arylaminonitriles as bioavailable peptidomimetic inhibitors of cathepsin B. Bioorg Med Chem Lett13:4121-4 (2003) Cathepsin B
Name:Cathepsin B
Type:Enzyme
Mol. Mass.:37819.69
Organism:Homo sapiens (Human)
Description:gi_63102437
Residue:339
BDBM50135543
NameBDBM50135543
Synonyms:3-{(R)-2-Cyano-2-[(S)-2-(2-methyl-1,3-dioxo-2,3-dihydro-1H-isoindol-5-ylamino)-3-m-tolyl-propionylamino]-ethoxymethyl}-benzoic acid | CHEMBL133728
TypeSmall organic molecule
Emp. Form.C30H28N4O6
Mol. Mass.540.5665
SMILESCN1C(=O)c2ccc(N[C@@H](Cc3cccc(C)c3)C(=O)N[C@@H](COCc3cccc(c3)C(O)=O)C#N)cc2C1=O