Reaction Details
TargetGlycogen phosphorylase, liver form
LigandBDBM50135559
Substrate/Competitorn/a
Meas. Tech.ChEBML_70983
IC50 13±n/a nM
Citation Lu, ZBohn, JBergeron, RDeng, QEllsworth, KPGeissler, WMHarris, GMcCann, PEMcKeever, BMyers, RWSaperstein, RWilloughby, CAYao, JChapman, K A new class of glycogen phosphorylase inhibitors. Bioorg Med Chem Lett13:4125-8 (2003) Glycogen phosphorylase, liver form
Name:Glycogen phosphorylase, liver form
Type:Homodimer
Mol. Mass.:97153.98
Organism:Homo sapiens (Human)
Description:Dimers associate into a tetramer to form the enzymatically active phosphorylase A.
Residue:847
BDBM50135559
NameBDBM50135559
Synonyms:4-{4-Fluoro-2-[(4-nitro-pyridine-2-carbonyl)-amino]-phenoxy}-phthalic acid | CHEMBL133114
TypeSmall organic molecule
Emp. Form.C20H12FN3O8
Mol. Mass.441.323
SMILESOC(=O)c1ccc(Oc2ccc(F)cc2NC(=O)c2cc(ccn2)[N+]([O-])=O)cc1C(O)=O