Reaction Details
TargetGlycogen phosphorylase, muscle form
LigandBDBM50135562
Substrate/Competitorn/a
Meas. Tech.ChEBML_70984
IC50 25±n/a nM
Citation Lu, ZBohn, JBergeron, RDeng, QEllsworth, KPGeissler, WMHarris, GMcCann, PEMcKeever, BMyers, RWSaperstein, RWilloughby, CAYao, JChapman, K A new class of glycogen phosphorylase inhibitors. Bioorg Med Chem Lett13:4125-8 (2003) Glycogen phosphorylase, muscle form
Name:Glycogen phosphorylase, muscle form
Type:PROTEIN
Mol. Mass.:97097.45
Organism:Homo sapiens (Human)
Description:ChEMBL_1449751
Residue:842
BDBM50135562
NameBDBM50135562
Synonyms:4-{2-[(4-Nitro-pyridine-2-carbonyl)-amino]-phenoxy}-phthalic acid | CHEMBL132191
TypeSmall organic molecule
Emp. Form.C20H13N3O8
Mol. Mass.423.3325
SMILESOC(=O)c1ccc(Oc2ccccc2NC(=O)c2cc(ccn2)[N+]([O-])=O)cc1C(O)=O