Reaction Details
TargetGlycogen phosphorylase, muscle form
LigandBDBM50135565
Substrate/Competitorn/a
Meas. Tech.ChEBML_70984
IC50 12±n/a nM
Citation Lu, ZBohn, JBergeron, RDeng, QEllsworth, KPGeissler, WMHarris, GMcCann, PEMcKeever, BMyers, RWSaperstein, RWilloughby, CAYao, JChapman, K A new class of glycogen phosphorylase inhibitors. Bioorg Med Chem Lett13:4125-8 (2003) Glycogen phosphorylase, muscle form
Name:Glycogen phosphorylase, muscle form
Type:PROTEIN
Mol. Mass.:97097.45
Organism:Homo sapiens (Human)
Description:ChEMBL_1449751
Residue:842
BDBM50135565
NameBDBM50135565
Synonyms:4-{3-[(4-Methoxy-pyridine-2-carbonyl)-amino]-naphthalen-2-yloxy}-phthalic acid | CHEMBL440528
TypeSmall organic molecule
Emp. Form.C25H18N2O7
Mol. Mass.458.4196
SMILESCOc1ccnc(c1)C(=O)Nc1cc2ccccc2cc1Oc1ccc(C(O)=O)c(c1)C(O)=O