Reaction Details
TargetNeuronal acetylcholine receptor subunit alpha-3/beta-2
LigandBDBM50135594
Substrate/Competitorn/a
Meas. Tech.ChEMBL_143248 (CHEMBL752536)
Ki 6.5±n/a nM
Citation Karig, GLarge, JMSharples, CGSutherland, AGallagher, TWonnacott, S Synthesis and nicotinic binding of novel phenyl derivatives of UB-165. Identifying factors associated with alpha7 selectivity. Bioorg Med Chem Lett13:2825-8 (2003) Neuronal acetylcholine receptor subunit alpha-3/beta-2
Name:Neuronal acetylcholine receptor subunit alpha-3/beta-2
Type:n/a
Mol. Mass.:n/a
Description:ASSAY_ID of EBI is 143246
Components:This complex has 2 components.
Component 1
Name:Neuronal acetylcholine receptor subunit beta-2
Synonyms:ACHB2_HUMAN Neuronal acetylcholine receptor protein beta-2 subunit | Nicotinic acetylcholine receptor alpha3/beta2/alpha5
Type:Protein
Mol. Mass.:57020.50
Organism:Homo sapiens (Human)
Description:P17787
Residue:502
Component 2
Name:Neuronal acetylcholine receptor subunit alpha-3
Synonyms:ACHA3_HUMAN Cholinergic, Nicotinic Alpha3Beta2 Cholinergic, Nicotinic Alpha3Beta4x NACHRA3 Neuronal acetylcholine receptor subunit alpha-3 nicotinic central
Type:Enzyme Catalytic Domain
Mol. Mass.:57479.03
Organism:Homo sapiens (Human)
Description:Cholinergic, Nicotinic Alpha3Beta2 0 HUMAN::P32297
Residue:505
BDBM50135594
NameBDBM50135594
Synonyms:(+/-)-2-(6-chloropyridin-3-yl)-9-aza-bicyclo[4.2.1]non-2-ene CHEMBL63102 | UB-165
TypeSmall organic molecule
Emp. Form.C13H15ClN2
Mol. Mass.234.725
SMILESClc1ccc(cn1)C1=CCCC2CCC1N2