Reaction Details
TargetNeuronal acetylcholine receptor subunit alpha-7
LigandBDBM50135594
Substrate/Competitorn/a
Meas. Tech.ChEBML_144181
Ki 2760±n/a nM
Citation Karig, GLarge, JMSharples, CGSutherland, AGallagher, TWonnacott, S Synthesis and nicotinic binding of novel phenyl derivatives of UB-165. Identifying factors associated with alpha7 selectivity. Bioorg Med Chem Lett13:2825-8 (2003) Neuronal acetylcholine receptor subunit alpha-7
Name:Neuronal acetylcholine receptor subunit alpha-7
Type:Enzyme
Mol. Mass.:56502.44
Organism:Rattus norvegicus (Rat)
Description:Q05941
Residue:502
BDBM50135594
NameBDBM50135594
Synonyms:(+/-)-2-(6-chloropyridin-3-yl)-9-aza-bicyclo[4.2.1]non-2-ene CHEMBL63102 | UB-165
TypeSmall organic molecule
Emp. Form.C13H15ClN2
Mol. Mass.234.725
SMILESClc1ccc(cn1)C1=CCCC2CCC1N2