Reaction Details
TargetNeuronal acetylcholine receptor subunit alpha-7
LigandBDBM50135597
Substrate/Competitorn/a
Meas. Tech.ChEBML_144181
Ki 89±n/a nM
Citation Karig, GLarge, JMSharples, CGSutherland, AGallagher, TWonnacott, S Synthesis and nicotinic binding of novel phenyl derivatives of UB-165. Identifying factors associated with alpha7 selectivity. Bioorg Med Chem Lett13:2825-8 (2003) Neuronal acetylcholine receptor subunit alpha-7
Name:Neuronal acetylcholine receptor subunit alpha-7
Type:Enzyme
Mol. Mass.:56502.44
Organism:Rattus norvegicus (Rat)
Description:Q05941
Residue:502
BDBM50135597
NameBDBM50135597
Synonyms:2-Pyridin-3-yl-9-aza-bicyclo[4.2.1]non-2-ene | CHEMBL444572
TypeSmall organic molecule
Emp. Form.C13H16N2
Mol. Mass.200.2795
SMILESC1CC2NC1CCC=C2c1cccnc1