Reaction Details
TargetProlyl endopeptidase
LigandBDBM50135633
Substrate/Competitorn/a
Meas. Tech.ChEMBL_157490 (CHEMBL765807)
Ki 0.280±n/a nM
Citation Bal, GVan der Veken, PAntonov, DLambeir, AMGrellier, PCroft, SLAugustyns, KHaemers, A Prolylisoxazoles: potent inhibitors of prolyloligopeptidase with antitrypanosomal activity. Bioorg Med Chem Lett13:2875-8 (2003) Prolyl endopeptidase
Name:Prolyl endopeptidase
Type:Enzyme
Mol. Mass.:80688.50
Organism:Homo sapiens (Human)
Description:P48147
Residue:710
BDBM50135633
NameBDBM50135633
Synonyms:(S)-2-[(S)-2-(5-Benzyloxymethyl-isoxazole-3-carbonyl)-pyrrolidine-1-carbonyl]-pyrrolidine-1-carboxylic acid benzyl ester CHEMBL318284
TypeSmall organic molecule
Emp. Form.C29H31N3O6
Mol. Mass.517.5729
SMILESO=C(OCc1ccccc1)N1CCC[C@H]1C(=O)N1CCC[C@H]1C(=O)c1cc(COCc2ccccc2)on1