Reaction Details
TargetAcetylcholinesterase
LigandBDBM50135654
Substrate/Competitorn/a
Meas. Tech.ChEBML_27674
Ki 130±n/a nM
Citation Lin, GTsai, HJTsai, YH Cage amines as the stopper inhibitors of cholinesterases. Bioorg Med Chem Lett13:2887-90 (2003) Acetylcholinesterase
Name:Acetylcholinesterase
Type:Enzyme
Mol. Mass.:71812.79
Organism:Electrophorus electricus (Electric eel)
Description:n/a
Residue:633
BDBM50135654
NameBDBM50135654
Synonyms:2,4,6,8,10,12-hexa(3,5-dimethoxyphenylmethyl)-2,4,6,8,10,12-hexaazatetracyclo[5.5.0.05,9.03,11]dodecane | CHEMBL413939
TypeSmall organic molecule
Emp. Form.C61H74N6O12
Mol. Mass.1083.2733
SMILESCOc1cc(CNC2C3N(Cc4cc(OC)cc(OC)c4)C4C(N(Cc5cc(OC)cc(OC)c5)C5(CC5N3Cc3cc(OC)cc(OC)c3)N4Cc3cc(OC)cc(OC)c3)N2Cc2cc(OC)cc(OC)c2)cc(OC)c1