Reaction Details
TargetPeroxisome proliferator-activated receptor alpha
LigandBDBM50135775
Substrate/Competitorn/a
Meas. Tech.ChEMBL_153537 (CHEMBL765406)
IC50 16±n/a nM
Citation Xu, YMayhugh, DSaeed, AWang, XThompson, RCDominianni, SJKauffman, RFSingh, JBean, JSBensch, WRBarr, RJOsborne, JMontrose-Rafizadeh, CZink, RWYumibe, NPHuang, NLuffer-Atlas, DRungta, DMaise, DEMantlo, NB Design and synthesis of a potent and selective triazolone-based peroxisome proliferator-activated receptor alpha agonist. J Med Chem46:5121-4 (2003) 
 
Peroxisome proliferator-activated receptor alpha
Name:Peroxisome proliferator-activated receptor alpha
Type:Enzyme
Mol. Mass.:52222.08
Organism:Homo sapiens (Human)
Description:Q07869
Residue:468
BDBM50135775
NameBDBM50135775
Synonyms:2-Methyl-2-(4-{3-[1-(4-methyl-benzyl)-5-oxo-4-propyl-4,5-dihydro-1H-[1,2,4]triazol-3-yl]-propyl}-phenoxy)-propionic acid | CHEMBL149676
TypeSmall organic molecule
Emp. Form.C26H33N3O4
Mol. Mass.451.5579
SMILESCCCn1c(CCCc2ccc(OC(C)(C)C(O)=O)cc2)nn(Cc2ccc(C)cc2)c1=O