Reaction Details
TargetFarnesyl pyrophosphate synthase
LigandBDBM50098382
Substrate/Competitorn/a
Meas. Tech.ChEMBL_69840 (CHEMBL681891)
Ki 510±n/a nM
Citation Sanders, JMGómez, AOMao, JMeints, GAVan Brussel, EMBurzynska, AKafarski, PGonzález-Pacanowska, DOldfield, E 3-D QSAR investigations of the inhibition of Leishmania major farnesyl pyrophosphate synthase by bisphosphonates. J Med Chem46:5171-83 (2003) 
 
Farnesyl pyrophosphate synthase
Name:Farnesyl pyrophosphate synthase
Type:Enzyme
Mol. Mass.:48272.89
Organism:Homo sapiens (Human)
Description:P14324
Residue:419
BDBM50098382
NameBDBM50098382
Synonyms:(1-Hydroxy-1-phosphono-3-pyridin-3-yl-propyl)-phosphonic acid 1-hydroxy-3-(pyridin-3-yl)propane-1,1-diyldiphosphonic acid 3-(3-hydrogen phosphonato-3-hydroxy-3-phosphonatopropyl)pyridin-1-ium CHEMBL293522
TypeSmall organic molecule
Emp. Form.C8H13NO7P2
Mol. Mass.297.1388
SMILESOC(CCc1cccnc1)(P(O)(O)=O)P(O)(O)=O