Reaction Details
TargetFarnesyl pyrophosphate synthase
LigandBDBM50135820
Substrate/Competitorn/a
Meas. Tech.ChEMBL_69840 (CHEMBL681891)
Ki 40±n/a nM
Citation Sanders, JMGómez, AOMao, JMeints, GAVan Brussel, EMBurzynska, AKafarski, PGonzález-Pacanowska, DOldfield, E 3-D QSAR investigations of the inhibition of Leishmania major farnesyl pyrophosphate synthase by bisphosphonates. J Med Chem46:5171-83 (2003) 
 
Farnesyl pyrophosphate synthase
Name:Farnesyl pyrophosphate synthase
Type:Enzyme
Mol. Mass.:48272.89
Organism:Homo sapiens (Human)
Description:P14324
Residue:419
BDBM50135820
NameBDBM50135820
Synonyms:2-(pyridin-4-ylamino)ethane-1,1-diyldiphosphonic acid [1-Phosphono-2-(pyridin-4-ylamino)-ethyl]-phosphonic acid
TypeSmall organic molecule
Emp. Form.C7H12N2O6P2
Mol. Mass.282.1275
SMILESOP(O)(=O)C(CNc1ccncc1)P(O)(O)=O