Reaction Details
TargetFarnesyl pyrophosphate synthase
LigandBDBM50113291
Substrate/Competitorn/a
Meas. Tech.ChEMBL_69840 (CHEMBL681891)
Ki 17±n/a nM
Citation Sanders, JMGómez, AOMao, JMeints, GAVan Brussel, EMBurzynska, AKafarski, PGonzález-Pacanowska, DOldfield, E 3-D QSAR investigations of the inhibition of Leishmania major farnesyl pyrophosphate synthase by bisphosphonates. J Med Chem46:5171-83 (2003) 
 
Farnesyl pyrophosphate synthase
Name:Farnesyl pyrophosphate synthase
Type:Enzyme
Mol. Mass.:48272.89
Organism:Homo sapiens (Human)
Description:P14324
Residue:419
BDBM50113291
NameBDBM50113291
Synonyms:(4-methylpyridin-2-ylamino)methylenediphosphonic acid CHEMBL55557 | [(4-Methyl-pyridin-2-ylamino)-phosphono-methyl]-phosphonic acid
TypeSmall organic molecule
Emp. Form.C7H12N2O6P2
Mol. Mass.282.1275
SMILESCc1ccnc(NC(P(O)(O)=O)P(O)(O)=O)c1