Reaction Details
TargetFarnesyl pyrophosphate synthase
LigandBDBM50135835
Substrate/Competitorn/a
Meas. Tech.ChEMBL_69840 (CHEMBL681891)
Ki 41±n/a nM
Citation Sanders, JMGómez, AOMao, JMeints, GAVan Brussel, EMBurzynska, AKafarski, PGonzález-Pacanowska, DOldfield, E 3-D QSAR investigations of the inhibition of Leishmania major farnesyl pyrophosphate synthase by bisphosphonates. J Med Chem46:5171-83 (2003) 
 
Farnesyl pyrophosphate synthase
Name:Farnesyl pyrophosphate synthase
Type:Enzyme
Mol. Mass.:48272.89
Organism:Homo sapiens (Human)
Description:P14324
Residue:419
BDBM50135835
NameBDBM50135835
Synonyms:(isoquinolin-1-ylamino)methylenediphosphonic acid CHEMBL291727 | [(ISOQUINOLIN-1-YLAMINO)-PHOSPHONO-METHYL]-PHOSPHONIC ACID
TypeSmall organic molecule
Emp. Form.C10H12N2O6P2
Mol. Mass.318.1596
SMILESOP(O)(=O)C(Nc1nccc2ccccc12)P(O)(O)=O